Target
Type-1 angiotensin II receptor A/B
Ligand
BDBM50230913
Substrate
Meas. Tech.
ChEMBL_34973 (CHEMBL649502)
IC50
22±n/a nM
Citation
 Sircar, IHodges, JCQuin, JBunker, AMWinters, RTEdmunds, JJKostlan, CRConnolly, CKesten, SJHamby, JM Nonpeptide angiotensin II receptor antagonists. 2. Design, synthesis, and structure-activity relationships of 2-alkyl-4-(1H-pyrrol-1-yl)-1H-imidazole derivatives: profile of 2-propyl-1-[[2'-(1H-tetrazol-5-yl)-[1,1' -biphenyl]-4-yl]-methyl]-4-[2-(trifluoroacetyl)-1H-pyrrol-1-yl]-1H- imidazole-5-car J Med Chem 36:2253-65 (1993)  
Target
Name:
Type-1 angiotensin II receptor A/B
Synonyms:
Angiotensin II receptor (AT-1) type-1 | Type-1A/Type-1B angiotensin II receptor
Type:
Mol. Mass.:
Description:
ASSAY_ID of ChEMBL is 901964
Components:
This complex has 2 components.
Component 1
Name:
Type-1 angiotensin II receptor B
Synonyms:
AGTRB_RAT Agtr1 Angiotensin II AT1B Angiotensin II type 1b (AT-1b) receptor Type-1B angiotensin II receptor
Type:
Enzyme Catalytic Domain
Mol. Mass.:
40929.44
Organism:
RAT
Description:
Angiotensin II AT1B 0 RAT::P29089
Residue:
359
  
Component 2
Name:
Type-1 angiotensin II receptor A
Synonyms:
AGTRA_RAT Agtr1 Angiotensin II AT1 Angiotensin II receptor (AT-1) type-1 Type-1A angiotensin II receptor
Type:
Enzyme Catalytic Domain
Mol. Mass.:
40910.53
Organism:
RAT
Description:
ANGIOTENSIN AT1 AGTR1 RAT::P25095
Residue:
359
  
Inhibitor
Name:
BDBM50230913
Synonyms:
CHEMBL75092
Type:
Small organic molecule
Emp. Form.:
C28H27N7O4
Mol. Mass.:
525.5585
SMILES:
CCCc1nc(c(C(O)=O)n1Cc1ccc(cc1)-c1ccccc1-c1nn[nH]n1)-n1ccc(c1)C(=O)OCC
: