Target
Leukotriene B4 receptor 1/2
Ligand
BDBM50231606
Substrate
Meas. Tech.
ChEMBL_88179 (CHEMBL700859)
IC50
2.9±n/a nM
Citation
 Sofia, MJFloreancig, PBach, NJBaker, SRCockerham, SLFleisch, JHFroelich, LLJackson, WTMarder, PRoman, CR o-phenylphenols: potent and orally active leukotriene B4 receptor antagonists. J Med Chem 36:3978-81 (1993)  
Target
Name:
Leukotriene B4 receptor 1/2
Synonyms:
Leukotriene B4 receptor
Type:
Mol. Mass.:
Description:
ASSAY_ID of ChEMBL is 88360
Components:
This complex has 2 components.
Component 1
Name:
Leukotriene B4 receptor 2
Synonyms:
BLT2R LT4R2_HUMAN LTB4-R 2 LTB4R2 Leukotriene B4 Leukotriene B4 receptor Leukotriene B4 receptor BLT2 Seven transmembrane receptor BLTR2
Type:
Enzyme Catalytic Domain
Mol. Mass.:
37964.86
Organism:
Homo sapiens (Human)
Description:
Leukotriene 2 0 HUMAN::Q9NPC1
Residue:
358
  
Component 2
Name:
Leukotriene B4 receptor 1
Synonyms:
BLT BLTR Chemoattractant receptor-like 1 GPR16 LTB4-R 1 Leukotriene B4 R1 Leukotriene B4 receptor 1 P2Y purinoceptor 7 | P2Y7
Type:
Enzyme Catalytic Domain
Mol. Mass.:
37582.68
Organism:
Homo sapiens (Human)
Description:
Q15722
Residue:
352
  
Inhibitor
Name:
BDBM50231606
Synonyms:
CHEMBL128755
Type:
Small organic molecule
Emp. Form.:
C24H31N4NaO3
Mol. Mass.:
446.5177
SMILES:
[Na+].CCc1cc(c(O)cc1OCCCCCC(C)(C)c1nn[n-]n1)-c1ccc(OC)cc1
: