Target
Tyrosine-protein kinase BTK
Ligand
BDBM50357312
Substrate
Meas. Tech.
ChEMBL_1644049 (CHEMBL3992978)
IC50
0.340000±n/a nM
Citation
 Zhao, DHuang, SQu, MWang, CLiu, ZLi, ZPeng, JLiu, KLi, YMa, XShu, X Structural optimization of diphenylpyrimidine derivatives (DPPYs) as potent Bruton's tyrosine kinase (BTK) inhibitors with improved activity toward B leukemia cell lines. Eur J Med Chem 126:444-455 (2017)  
Target
Name:
Tyrosine-protein kinase BTK
Synonyms:
AGMX1 Agammaglobulinaemia tyrosine kinase B cell progenitor kinase BPK BTK_HUMAN Tyrosine Kinase BTK Tyrosine-protein kinase BTK (BTK)
Type:
Enzyme
Mol. Mass.:
76289.95
Organism:
Homo sapiens (Human)
Description:
Q06187
Residue:
659
  
Inhibitor
Name:
BDBM50357312
Synonyms:
IBRUTINIB US10124003, Ref. Ex. Compound 1 US10793575, Example ibrutinib US10919899, Ibrutinib US11186578, Example Ibrutinib US11407754, Example Ibrutinib US9108973, Ref 1 US9278100, 1
Type:
Small organic molecule
Emp. Form.:
C25H24N6O2
Mol. Mass.:
440.4971
SMILES:
Nc1ncnc2n(nc(-c3ccc(Oc4ccccc4)cc3)c12)[C@@H]1CCCN(C1)C(=O)C=C
: