Target
Carbonic anhydrase 12
Ligand
BDBM50230203
Substrate
Meas. Tech.
ChEMBL_1644700 (CHEMBL3993629)
Ki
81±n/a nM
Citation
 Bua, SDi Cesare Mannelli, LVullo, DGhelardini, CBartolucci, GScozzafava, ASupuran, CTCarta, F Design and Synthesis of Novel Nonsteroidal Anti-Inflammatory Drugs and Carbonic Anhydrase Inhibitors Hybrids (NSAIDs-CAIs) for the Treatment of Rheumatoid Arthritis. J Med Chem 60:1159-1170 (2017)  
Target
Name:
Carbonic anhydrase 12
Synonyms:
CA-XII CAH12_HUMAN Carbonic anhydrase Carbonic anhydrase XII Carbonic anhydrase XII (CAXII) | Tumor antigen HOM-RCC-3.1.3
Type:
Enzyme
Mol. Mass.:
39456.00
Organism:
Homo sapiens (Human)
Description:
Catalytic domain of human cloned isozyme was used in the assay
Residue:
354
  
Inhibitor
Name:
BDBM50230203
Synonyms:
CHEMBL4067437
Type:
Small organic molecule
Emp. Form.:
C25H23NO5
Mol. Mass.:
417.4538
SMILES:
COc1ccc2cc(ccc2c1)[C@H](C)C(=O)NCCOc1ccc2ccc(=O)oc2c1
: