Target
Carbonic anhydrase 7
Ligand
BDBM50230203
Substrate
Meas. Tech.
ChEMBL_1644698 (CHEMBL3993627)
Ki
>100±n/a nM
Citation
 Bua, SDi Cesare Mannelli, LVullo, DGhelardini, CBartolucci, GScozzafava, ASupuran, CTCarta, F Design and Synthesis of Novel Nonsteroidal Anti-Inflammatory Drugs and Carbonic Anhydrase Inhibitors Hybrids (NSAIDs-CAIs) for the Treatment of Rheumatoid Arthritis. J Med Chem 60:1159-1170 (2017)  
Target
Name:
Carbonic anhydrase 7
Synonyms:
CA-VII CAH7_HUMAN Carbonic anhydrase Carbonic anhydrase VII (CA VII)
Type:
Enzyme
Mol. Mass.:
29664.11
Organism:
Homo sapiens (Human)
Description:
Human cloned isozyme.
Residue:
264
  
Inhibitor
Name:
BDBM50230203
Synonyms:
CHEMBL4067437
Type:
Small organic molecule
Emp. Form.:
C25H23NO5
Mol. Mass.:
417.4538
SMILES:
COc1ccc2cc(ccc2c1)[C@H](C)C(=O)NCCOc1ccc2ccc(=O)oc2c1
: