Target
Protein mono-ADP-ribosyltransferase PARP4
Ligand
BDBM50316226
Substrate
Meas. Tech.
ChEMBL_1646307 (CHEMBL3995363)
IC50
446±n/a nM
Citation
 Thorsell, AGEkblad, TKarlberg, TLöw, MPinto, AFTrésaugues, LMoche, MCohen, MSSchüler, H Structural Basis for Potency and Promiscuity in Poly(ADP-ribose) Polymerase (PARP) and Tankyrase Inhibitors. J Med Chem 60:1262-1271 (2017)  
Target
Name:
Protein mono-ADP-ribosyltransferase PARP4
Synonyms:
(ARTD4 or PARP4) 2.4.2.- ADP-ribosyltransferase diphtheria toxin-like 4 ADPRTL1 KIAA0177 PARP-4 PARP4 PARPL Poly [ADP-ribose] polymerase 4 VPARP | Vault poly(ADP-ribose) polymerase
Type:
Mol. Mass.:
192563.23
Organism:
Homo sapiens (Human)
Description:
Q9UKK3
Residue:
1724
  
Inhibitor
Name:
BDBM50316226
Synonyms:
(S)-2-(4-(piperidin-3-yl)phenyl)-2H-indazole-7-carboxamide MK-4827 | Niraparib
Type:
Small organic molecule
Emp. Form.:
C19H20N4O
Mol. Mass.:
320.3883
SMILES:
NC(=O)c1cccc2cn(nc12)-c1ccc(cc1)[C@@H]1CCCNC1
: