Target
Acetylcholine receptor subunit alpha/beta/delta/epsilon
Ligand
BDBM50232597
Substrate
Meas. Tech.
ChEMBL_1648188 (CHEMBL3997244)
EC50
>100000±n/a nM
Citation
 Iwuagwu, CKing, DMcDonald, IMCook, JZusi, FCHill, MDMate, RAFang, HKnox, RGallagher, LPost-Munson Amy Easton, DMiller, RBenitex, YSiuciak, JLodge, NZaczek, RMorgan, DBristow, LMacor, JEOlson, RE Design and synthesis of a novel series of 4-heteroarylamino-1'-azaspiro[oxazole-5,3'-bicyclo[2.2.2]octanes asa7 nicotinic receptor agonists 2. Development of 4-heteroaryl SAR. Bioorg Med Chem Lett 27:1261-1266 (2017)  
Target
Name:
Acetylcholine receptor subunit alpha/beta/delta/epsilon
Synonyms:
Nicotinic acetylcholine receptor alpha-1/beta-1/delta/epsilon
Type:
Mol. Mass.:
Description:
ASSAY_ID of ChEMBL is 1648188
Components:
This complex has 4 components.
Component 1
Name:
Acetylcholine receptor subunit alpha
Synonyms:
ACHA_HUMAN Acetylcholine receptor protein alpha chain CHNRA Cholinergic, Nicotinic Alpha1Beta1DeltaGamma Nicotinic acetylcholine receptor alpha-1/beta-1 Nicotinic acetylcholine receptor alpha2/beta4 n-AChR
Type:
Ion channel
Mol. Mass.:
54542.01
Organism:
Homo sapiens (Human)
Description:
Residue:
482
  
Component 2
Name:
Acetylcholine receptor subunit beta
Synonyms:
ACHB_HUMAN Acetylcholine receptor subunit beta CHRNB1 | Nicotinic acetylcholine receptor alpha-1/beta-1/delta/epsilon
Type:
PROTEIN
Mol. Mass.:
56691.23
Organism:
Homo sapiens (Human)
Description:
EBI_10924
Residue:
501
  
Component 3
Name:
Acetylcholine receptor subunit delta
Synonyms:
ACHD_HUMAN Acetylcholine receptor protein delta chain Muscle-type nicotinic acetylcholine receptor | Nicotinic acetylcholine receptor alpha-1/beta-1/delta/epsilon
Type:
PROTEIN
Mol. Mass.:
58894.39
Organism:
Homo sapiens (Human)
Description:
ChEMBL_142595
Residue:
517
  
Component 4
Name:
Acetylcholine receptor subunit epsilon
Synonyms:
ACHE_HUMAN Acetylcholine receptor protein epsilon chain Nicotinic acetylcholine receptor alpha-1/beta-1/delta/epsilon
Type:
PROTEIN
Mol. Mass.:
54686.87
Organism:
Homo sapiens (Human)
Description:
ChEMBL_431077
Residue:
493
  
Inhibitor
Name:
BDBM50232597
Synonyms:
CHEMBL4092614
Type:
Small organic molecule
Emp. Form.:
C13H17N5O
Mol. Mass.:
259.307
SMILES:
C1N=C(Nc2cncnc2)O[C@]11CN2CCC1CC2
: