Target
Activin receptor type-1
Ligand
BDBM50262079
Substrate
Meas. Tech.
ChEMBL_1649713 (CHEMBL3998847)
IC50
3.3±n/a nM
Citation
 Cho, HSengupta, SJeon, SSHur, WChoi, HGSeo, HSLee, BJKim, JHChung, MJeon, NLKim, NDSim, T Identification of the First Selective Activin Receptor-Like Kinase 1 Inhibitor, a Reversible Version of L-783277. J Med Chem 60:1495-1508 (2017)  
Target
Name:
Activin receptor type-1
Synonyms:
2.7.11.30 ACVR1 ACVRLK2 ALK2/ACVR1 Activin receptor-like kinase 2 Activin receptor-like kinase 2 (ALK2/ACVR1) SKR1 TGF-B superfamily receptor type I | TSR-I
Type:
Mol. Mass.:
57158.32
Organism:
Homo sapiens (Human)
Description:
Residue:
509
  
Inhibitor
Name:
BDBM50262079
Synonyms:
4-(6-(4-(piperazin-1-yl)phenyl)pyrazolo[1,5-a]pyrimidin-3-yl)quinoline CHEMBL513147 | LDN-193189
Type:
Small organic molecule
Emp. Form.:
C25H22N6
Mol. Mass.:
406.4824
SMILES:
C1CN(CCN1)c1ccc(cc1)-c1cnc2c(cnn2c1)-c1ccnc2ccccc12
: