Target
Histone deacetylase 8
Ligand
BDBM29589
Substrate
Meas. Tech.
ChEMBL_1649739 (CHEMBL3998873)
IC50
1780±n/a nM
Citation
 Reddy, DRBallante, FZhou, NJMarshall, GR Design and synthesis of benzodiazepine analogs as isoform-selective human lysine deacetylase inhibitors. Eur J Med Chem 127:531-553 (2017)  
Target
Name:
Histone deacetylase 8
Synonyms:
HD8 HDAC8_HUMAN Histone deacetylase 8 (HDAC-8) | Human HDAC8
Type:
Enzyme
Mol. Mass.:
41749.60
Organism:
Homo sapiens (Human)
Description:
Q9BY41
Residue:
377
  
Inhibitor
Name:
BDBM29589
Synonyms:
Faridak LBH-589B US10722597, Compound Panobinostat
Type:
Small organic molecule
Emp. Form.:
C21H23N3O2
Mol. Mass.:
349.4262
SMILES:
Cc1[nH]c2ccccc2c1CCNCc1ccc(\C=C\C(=O)NO)cc1
: