Target
Sigma non-opioid intracellular receptor 1
Ligand
BDBM50001043
Substrate
Meas. Tech.
ChEMBL_1651363 (CHEMBL4000618)
Ki
3.8±n/a nM
Citation
 Prezzavento, OArena, ESánchez-Fernández, CTurnaturi, RParenti, CMarrazzo, ACatalano, RAmata, EPasquinucci, LCobos, EJ (+)-and (-)-Phenazocine enantiomers: Evaluation of their dual opioid agonist/s Eur J Med Chem 125:603-610 (2017)  
Target
Name:
Sigma non-opioid intracellular receptor 1
Synonyms:
OPRS1 SIGMAR1 Sigma non-opioid intracellular receptor 1 Sigma1-receptor Sterol isomerase-like protein
Type:
Protein
Mol. Mass.:
25307.17
Organism:
Cavia porcellus (Guinea pig)
Description:
Q60492
Residue:
223
  
Inhibitor
Name:
BDBM50001043
Synonyms:
6,11-Dimethyl-3-phenethyl-1,2,3,4,5,6-hexahydro-2,6-methano-benzo[d]azocin-8-ol | CHEMBL94350
Type:
Small organic molecule
Emp. Form.:
C22H27NO
Mol. Mass.:
321.4559
SMILES:
C[C@@H]1[C@@H]2Cc3ccc(O)cc3[C@]1(C)CCN2CCc1ccccc1
: