Target
Histamine H2 receptor
Ligand
BDBM181119
Substrate
Meas. Tech.
ChEMBL_1651917 (CHEMBL4001172)
IC50
500±n/a nM
Citation
 Odell, LRAbdel-Hamid, MKHill, TAChau, NYoung, KADeane, FMSakoff, JAAndersson, SDaniel, JARobinson, PJMcCluskey, A Pyrimidine-Based Inhibitors of Dynamin I GTPase Activity: Competitive Inhibition at the Pleckstrin Homology Domain. J Med Chem 60:349-361 (2017)  
Target
Name:
Histamine H2 receptor
Synonyms:
Gastric receptor I HISTAMINE H2 HRH2_HUMAN Histamine H2-Gs alpha S
Type:
G Protein-Coupled Receptor (GPCR)
Mol. Mass.:
40115.31
Organism:
Homo sapiens (Human)
Description:
Residue:
359
  
Inhibitor
Name:
BDBM181119
Synonyms:
US9138393, Cimetidine | US9144538, Cimetidine
Type:
Small organic molecule
Emp. Form.:
C10H16N6S
Mol. Mass.:
252.339
SMILES:
CN\C(NC#N)=N\CCSCc1nc[nH]c1C
: