Target
Polyphenol oxidase 2
Ligand
BDBM50234121
Substrate
Meas. Tech.
ChEMBL_1652196 (CHEMBL4001451)
IC50
1350±n/a nM
Citation
 Xie, WZhang, HHe, JZhang, JYu, QLuo, CLi, S Synthesis and biological evaluation of novel hydroxybenzaldehyde-based kojic acid analogues as inhibitors of mushroom tyrosinase. Bioorg Med Chem Lett 27:530-532 (2017)  
Target
Name:
Polyphenol oxidase 2
Synonyms:
Monophenol monooxygenase PPO2 Tyrosinase
Type:
Protein
Mol. Mass.:
63923.66
Organism:
Agaricus bisporus (Common mushroom)
Description:
O42713
Residue:
556
  
Inhibitor
Name:
BDBM50234121
Synonyms:
CHEMBL4069921
Type:
Small organic molecule
Emp. Form.:
C21H18N4O5S
Mol. Mass.:
438.456
SMILES:
Oc1ccc(CNn2c(SCc3cc(=O)c(O)co3)nnc2-c2ccccc2)c(O)c1
: