Target
Amine oxidase [flavin-containing] A
Ligand
BDBM10989
Substrate
Meas. Tech.
ChEMBL_1654033 (CHEMBL4003399)
IC50
1420±n/a nM
Citation
 Li, YQiang, XLuo, LYang, XXiao, GLiu, QAi, JTan, ZDeng, Y Aurone Mannich base derivatives as promising multifunctional agents with acetylcholinesterase inhibition, anti-ß-amyloid aggragation and neuroprotective properties for the treatment of Alzheimer's disease. Eur J Med Chem 126:762-775 (2017)  
Target
Name:
Amine oxidase [flavin-containing] A
Synonyms:
AOFA_HUMAN MAO-A Monoamine oxidase Monoamine oxidase type A (MAO A) Monoamine oxidase type A (MAOA)
Type:
Protein
Mol. Mass.:
59689.53
Organism:
Homo sapiens (Human)
Description:
P21397
Residue:
527
  
Inhibitor
Name:
BDBM10989
Synonyms:
(1R)-N-(prop-2-yn-1-yl)-2,3-dihydro-1H-inden-1-amine Rasagiline | US9034303, Rasagiline
Type:
Small organic molecule
Emp. Form.:
C12H13N
Mol. Mass.:
171.2383
SMILES:
C#CCN[C@@H]1CCc2ccccc12
: