Target
Tissue factor
Ligand
BDBM50235150
Substrate
Meas. Tech.
ChEBML_1654816
IC50
0.280000±n/a nM
Citation
 Wang, WWXu, SHZhao, YZZhang, CZhang, YYYu, BYZhang, J Microbial hydroxylation and glycosylation of pentacyclic triterpenes as inhibitors on tissue factor procoagulant activity. Bioorg Med Chem Lett 27:1026-1030 (2017)  
Target
Name:
Tissue factor
Synonyms:
CD_antigen=CD142 Coagulation factor VII/tissue factor TF Thromboplastin | Tissue factor
Type:
PROTEIN
Mol. Mass.:
33067.61
Organism:
Homo sapiens (Human)
Description:
ChEMBL_936735
Residue:
295
  
Inhibitor
Name:
BDBM50235150
Synonyms:
CHEBI:67947 | CHEMBL1910843
Type:
Small organic molecule
Emp. Form.:
C36H58O9
Mol. Mass.:
634.8403
SMILES:
[H][C@@]12CC(C)(C)CC[C@@]1(CC[C@]1(C)C2=CC[C@]2([H])[C@@]3(C)CC[C@H](O)[C@@](C)(CO)[C@]3([H])CC[C@@]12C)C(=O)O[C@@H]1O[C@H](CO)[C@@H](O)[C@H](O)[C@H]1O
: