Target
Potassium voltage-gated channel subfamily A member 5
Ligand
BDBM50235247
Substrate
Meas. Tech.
ChEBML_1655133
IC50
133±n/a nM
Citation
 Wolkenberg, SENolt, MBBilodeau, MTTrotter, BWManley, PJKett, NRNanda, KKWu, ZCato, MJKane, SAKiss, LSpencer, RHWang, JLynch, JJRegan, CPStump, GLLi, BWhite, RYeh, SDinsmore, CJLindsley, CWHartman, GD Discovery of MK-1832, a Kv1.5 inhibitor with improved selectivity and pharmacokinetics. Bioorg Med Chem Lett 27:1062-1069 (2017)  
Target
Name:
Potassium voltage-gated channel subfamily A member 5
Synonyms:
HK2 KCNA5 Potassium voltage-gated channel subfamily A member 5 Voltage-gated potassium channel subunit Kv1.5
Type:
Enzyme
Mol. Mass.:
67222.47
Organism:
Homo sapiens (Human)
Description:
P22460
Residue:
613
  
Inhibitor
Name:
BDBM50235247
Synonyms:
CHEMBL4079636
Type:
Small organic molecule
Emp. Form.:
C27H21N3
Mol. Mass.:
387.4757
SMILES:
C(C(c1cccnc1)c1cccnc1)c1ccccc1-c1cncc2ccccc12
: