Target
Potassium voltage-gated channel subfamily A member 5
Ligand
BDBM50235261
Substrate
Meas. Tech.
ChEMBL_1655133 (CHEMBL4004499)
IC50
171±n/a nM
Citation
 Wolkenberg, SENolt, MBBilodeau, MTTrotter, BWManley, PJKett, NRNanda, KKWu, ZCato, MJKane, SAKiss, LSpencer, RHWang, JLynch, JJRegan, CPStump, GLLi, BWhite, RYeh, SDinsmore, CJLindsley, CWHartman, GD Discovery of MK-1832, a Kv1.5 inhibitor with improved selectivity and pharmacokinetics. Bioorg Med Chem Lett 27:1062-1069 (2017)  
Target
Name:
Potassium voltage-gated channel subfamily A member 5
Synonyms:
HK2 KCNA5 Potassium voltage-gated channel subfamily A member 5 Voltage-gated potassium channel subunit Kv1.5
Type:
Enzyme
Mol. Mass.:
67222.47
Organism:
Homo sapiens (Human)
Description:
P22460
Residue:
613
  
Inhibitor
Name:
BDBM50235261
Synonyms:
CHEMBL4061731
Type:
Small organic molecule
Emp. Form.:
C23H18ClN3O
Mol. Mass.:
387.862
SMILES:
OC(C(c1cccnc1)c1cccnc1)c1cccnc1-c1ccccc1Cl
: