Target
Histone-lysine N-methyltransferase, H3 lysine-79 specific
Ligand
BDBM50235302
Substrate
Meas. Tech.
ChEMBL_1655317 (CHEMBL4004683)
Ki
0.002000±n/a nM
Citation
 Möbitz, HMachauer, RHolzer, PVaupel, AStauffer, FRagot, CCaravatti, GScheufler, CFernandez, CHommel, UTiedt, RBeyer, KSChen, CZhu, HGaul, C Discovery of Potent, Selective, and Structurally Novel Dot1L Inhibitors by a Fragment Linking Approach. ACS Med Chem Lett 8:338-343 (2017)  
Target
Name:
Histone-lysine N-methyltransferase, H3 lysine-79 specific
Synonyms:
2.1.1.43 DOT1-like protein (Dot1L) DOT1L_HUMAN Histone H3-K79 methyltransferase Histone Methyltransferase DOT1L KIAA1814 Lysine N-methyltransferase 4
Type:
Protein
Mol. Mass.:
184911.91
Organism:
Homo sapiens (Human)
Description:
Q8TEK3
Residue:
1537
  
Inhibitor
Name:
BDBM50235302
Synonyms:
CHEMBL4099771
Type:
Small organic molecule
Emp. Form.:
C32H36ClN9O2S
Mol. Mass.:
646.205
SMILES:
CN(CCCNC(=O)CNC(=O)Nc1ccc2sc(Cl)c(-c3cccnc3C)c2c1)[C@@H]1CCCN(C1)c1ncnc2[nH]ccc12
: