Target
Polyunsaturated fatty acid lipoxygenase ALOX15B
Ligand
BDBM50235700
Substrate
Meas. Tech.
ChEMBL_1657726 (CHEMBL4007196)
IC50
140±n/a nM
Citation
 Zaware, NKisliuk, RBastian, AIhnat, MAGangjee, A Synthesis and evaluation of 5-(arylthio)-9H-pyrimido[4,5-b]indole-2,4-diamines as receptor tyrosine kinase and thymidylate synthase inhibitors and as antitumor agents. Bioorg Med Chem Lett 27:1602-1607 (2017)  
Target
Name:
Polyunsaturated fatty acid lipoxygenase ALOX15B
Synonyms:
Alox15b LX15B_RAT
Type:
PROTEIN
Mol. Mass.:
76140.88
Organism:
Rattus norvegicus
Description:
ChEMBL_12426
Residue:
677
  
Inhibitor
Name:
BDBM50235700
Synonyms:
CHEMBL4096329
Type:
Small organic molecule
Emp. Form.:
C17H15N5OS
Mol. Mass.:
337.399
SMILES:
COc1ccc(Sc2cccc3[nH]c4nc(N)nc(N)c4c23)cc1
: