Target
Polyunsaturated fatty acid lipoxygenase ALOX15B
Ligand
BDBM50027655
Substrate
Meas. Tech.
ChEMBL_1657726 (CHEMBL4007196)
IC50
380±n/a nM
Citation
 Zaware, NKisliuk, RBastian, AIhnat, MAGangjee, A Synthesis and evaluation of 5-(arylthio)-9H-pyrimido[4,5-b]indole-2,4-diamines as receptor tyrosine kinase and thymidylate synthase inhibitors and as antitumor agents. Bioorg Med Chem Lett 27:1602-1607 (2017)  
Target
Name:
Polyunsaturated fatty acid lipoxygenase ALOX15B
Synonyms:
Alox15b LX15B_RAT
Type:
PROTEIN
Mol. Mass.:
76140.88
Organism:
Rattus norvegicus
Description:
ChEMBL_12426
Residue:
677
  
Inhibitor
Name:
BDBM50027655
Synonyms:
CHEBI:5847 Tomudex ZD-16 | ZD-1694
Type:
Small organic molecule
Emp. Form.:
C21H22N4O6S
Mol. Mass.:
458.488
SMILES:
CN(Cc1ccc2[nH]c(C)nc(=O)c2c1)c1ccc(s1)C(=O)N[C@@H](CCC(O)=O)C(O)=O
: