Target
Toll-like receptor 7
Ligand
BDBM50236191
Substrate
Meas. Tech.
ChEMBL_1658795 (CHEMBL4008407)
EC50
714±n/a nM
Citation
 Beesu, MSalyer, ACBrush, MJTrautman, KLHill, JKDavid, SA Identification of High-Potency Human TLR8 and Dual TLR7/TLR8 Agonists in Pyrimidine-2,4-diamines. J Med Chem 60:2084-2098 (2017)  
Target
Name:
Toll-like receptor 7
Synonyms:
ORF Names:UNQ248/PRO285 TLR7_HUMAN | Toll-like receptor 7 (TLR7)
Type:
Enzyme
Mol. Mass.:
120945.35
Organism:
Homo sapiens (Human)
Description:
Q9NYK1
Residue:
1049
  
Inhibitor
Name:
BDBM50236191
Synonyms:
CHEMBL4083025
Type:
Small organic molecule
Emp. Form.:
C16H29N5S
Mol. Mass.:
323.5
SMILES:
CCCCNc1nc(N)nc(C)c1CCCN1CCSCC1
: