Target
Sigma non-opioid intracellular receptor 1
Ligand
BDBM50041266
Substrate
Meas. Tech.
ChEMBL_1660368 (CHEMBL4009980)
Ki
0.900000±n/a nM
Citation
 Glennon, RA The 2014 Philip S. Portoghese Medicinal Chemistry Lectureship: The"Phenylalkylaminome" with a Focus on Selected Drugs of Abuse. J Med Chem 60:2605-2628 (2017)  
Target
Name:
Sigma non-opioid intracellular receptor 1
Synonyms:
OPRS1 SIGMAR1 Sigma non-opioid intracellular receptor 1 Sigma1-receptor Sterol isomerase-like protein
Type:
Protein
Mol. Mass.:
25307.17
Organism:
Cavia porcellus (Guinea pig)
Description:
Q60492
Residue:
223
  
Inhibitor
Name:
BDBM50041266
Synonyms:
((S)-1-Methyl-2-phenyl-ethyl)-(5-phenyl-pentyl)-amine | CHEMBL20700
Type:
Small organic molecule
Emp. Form.:
C20H27N
Mol. Mass.:
281.4351
SMILES:
C[C@@H](Cc1ccccc1)NCCCCCc1ccccc1
: