Target
D(2) dopamine receptor
Ligand
BDBM50056446
Substrate
Meas. Tech.
ChEMBL_1661614 (CHEMBL4011226)
EC50
17±n/a nM
Citation
 Bonifazi, AYano, HEllenberger, MPMuller, LKumar, VZou, MFCai, NSGuerrero, AMWoods, ASShi, LNewman, AH Novel Bivalent Ligands Based on the Sumanirole Pharmacophore Reveal Dopamine D J Med Chem 60:2890-2907 (2017)  
Target
Name:
D(2) dopamine receptor
Synonyms:
D(2) dopamine receptor DOPAMINE D2 Long DRD2 Dopamine D2 receptor Dopamine D2 receptor (D2R) Dopamine2-like | d2
Type:
Cell-surface receptors
Mol. Mass.:
50647.10
Organism:
Homo sapiens (Human)
Description:
P14416
Residue:
443
  
Inhibitor
Name:
BDBM50056446
Synonyms:
(R)-5-Propylamino-5,6-dihydro-1H,4H-imidazo[4,5,1-ij]quinolin-2-one | CHEMBL434665
Type:
Small organic molecule
Emp. Form.:
C13H17N3O
Mol. Mass.:
231.2936
SMILES:
CCCN[C@@H]1Cc2cccc3[nH]c(=O)n(C1)c23
: