Target
D(2) dopamine receptor
Ligand
BDBM50018958
Substrate
Meas. Tech.
ChEMBL_1661610 (CHEMBL4011222)
EC50
353±n/a nM
Citation
 Bonifazi, AYano, HEllenberger, MPMuller, LKumar, VZou, MFCai, NSGuerrero, AMWoods, ASShi, LNewman, AH Novel Bivalent Ligands Based on the Sumanirole Pharmacophore Reveal Dopamine D J Med Chem 60:2890-2907 (2017)  
Target
Name:
D(2) dopamine receptor
Synonyms:
D(2) dopamine receptor DOPAMINE D2 Long DRD2 Dopamine D2 receptor Dopamine D2 receptor (D2R) Dopamine2-like | d2
Type:
Cell-surface receptors
Mol. Mass.:
50647.10
Organism:
Homo sapiens (Human)
Description:
P14416
Residue:
443
  
Inhibitor
Name:
BDBM50018958
Synonyms:
CHEBI:75401 | QUINPIROLE
Type:
Small organic molecule
Emp. Form.:
C13H21N3
Mol. Mass.:
219.3259
SMILES:
[H][C@]12CCCN(CCC)[C@]1([H])Cc1c[nH]nc1C2
: