Target
Sodium channel protein type 9 subunit alpha
Ligand
BDBM50237517
Substrate
Meas. Tech.
ChEMBL_1660140 (CHEMBL4009752)
IC50
7.5±n/a nM
Citation
 Wu, YJGuernon, JShi, JDitta, JRobbins, KJRajamani, REaston, ANewton, ABourin, CMosure, KSoars, MGKnox, RJMatchett, MPieschl, RLPost-Munson, DJWang, SHerrington, JGraef, JNewberry, KBristow, LJMeanwell, NAOlson, RThompson, LADzierba, C Development of New Benzenesulfonamides As Potent and Selective Na J Med Chem 60:2513-2525 (2017)  
Target
Name:
Sodium channel protein type 9 subunit alpha
Synonyms:
Kiaa4197 Peripheral sodium channel 1 Scn9a Sodium channel protein type IX subunit alpha | Voltage-gated sodium channel subunit alpha Nav1.7
Type:
PROTEIN
Mol. Mass.:
225808.99
Organism:
Mus musculus
Description:
ChEMBL_109594
Residue:
1984
  
Inhibitor
Name:
BDBM50237517
Synonyms:
CHEMBL4078268 | US10836758, Example 20
Type:
Small organic molecule
Emp. Form.:
C16H20ClFN4O2S2
Mol. Mass.:
418.937
SMILES:
N[C@H]1CC[C@@H](CNc2cc(F)c(cc2Cl)S(=O)(=O)Nc2nccs2)CC1
: