Target
Sodium-dependent noradrenaline transporter
Ligand
BDBM50389125
Substrate
Meas. Tech.
ChEMBL_1661732 (CHEMBL4011344)
EC50
>10000±n/a nM
Citation
 Tosh, DKJanowsky, AEshleman, AJWarnick, EGao, ZGChen, ZGizewski, EAuchampach, JASalvemini, DJacobson, KA Scaffold Repurposing of Nucleosides (Adenosine Receptor Agonists): Enhanced Activity at the Human Dopamine and Norepinephrine Sodium Symporters. J Med Chem 60:3109-3123 (2017)  
Target
Name:
Sodium-dependent noradrenaline transporter
Synonyms:
Monoamine transporter NET Noradrenaline Transporter (NET) Norepinephrine transporter protein (NET) SLC6A2 Sodium-dependent noradrenaline transporter (NET) | Solute carrier family 6 member 2
Type:
Multi-pass membrane protein
Mol. Mass.:
69337.72
Organism:
Homo sapiens (Human)
Description:
P23975
Residue:
617
  
Inhibitor
Name:
BDBM50389125
Synonyms:
CHEMBL2064645
Type:
Small organic molecule
Emp. Form.:
C22H20F2N6O3
Mol. Mass.:
454.4294
SMILES:
CNC(=O)[C@@]12C[C@@H]1[C@H]([C@H](O)[C@@H]2O)n1cnc2c(NC)nc(nc12)C#Cc1ccc(F)c(F)c1
: