Target
Sodium-dependent dopamine transporter
Ligand
BDBM50237600
Substrate
Meas. Tech.
ChEMBL_1661729 (CHEMBL4011341)
EC50
550±n/a nM
Citation
 Tosh, DKJanowsky, AEshleman, AJWarnick, EGao, ZGChen, ZGizewski, EAuchampach, JASalvemini, DJacobson, KA Scaffold Repurposing of Nucleosides (Adenosine Receptor Agonists): Enhanced Activity at the Human Dopamine and Norepinephrine Sodium Symporters. J Med Chem 60:3109-3123 (2017)  
Target
Name:
Sodium-dependent dopamine transporter
Synonyms:
DA transporter DAT1 Dopamine transporter protein (DAT) SC6A3_HUMAN Sodium-dependent dopamine transporter Solute carrier family 6 member 3
Type:
Multi-pass membrane protein
Mol. Mass.:
68497.11
Organism:
Homo sapiens (Human)
Description:
Q01959
Residue:
620
  
Inhibitor
Name:
BDBM50237600
Synonyms:
CHEMBL4071867
Type:
Small organic molecule
Emp. Form.:
C21H20ClN5O3S
Mol. Mass.:
457.933
SMILES:
[H][C@]12C[C@]1([C@@H](O)[C@@H](O)[C@@H]2n1cnc2c(NC)nc(cc12)C#Cc1ccc(Cl)s1)C(=O)NC
: