Target
Transmembrane domain-containing protein TMIGD3
Ligand
BDBM50236779
Substrate
Meas. Tech.
ChEMBL_1661723 (CHEMBL4011335)
Ki
6.3±n/a nM
Citation
 Tosh, DKJanowsky, AEshleman, AJWarnick, EGao, ZGChen, ZGizewski, EAuchampach, JASalvemini, DJacobson, KA Scaffold Repurposing of Nucleosides (Adenosine Receptor Agonists): Enhanced Activity at the Human Dopamine and Norepinephrine Sodium Symporters. J Med Chem 60:3109-3123 (2017)  
Target
Name:
Transmembrane domain-containing protein TMIGD3
Synonyms:
TMIG3_HUMAN Transmembrane domain-containing protein TMIGD3
Type:
PROTEIN
Mol. Mass.:
30335.79
Organism:
Homo sapiens (Human)
Description:
ChEMBL_114868
Residue:
266
  
Inhibitor
Name:
BDBM50236779
Synonyms:
CHEMBL4086593
Type:
Small organic molecule
Emp. Form.:
C20H21ClN6O4S
Mol. Mass.:
476.937
SMILES:
CCCNc1nc(nc2n(cnc12)[C@@H]1O[C@@H]([C@@H](O)[C@H]1O)C(=O)NC)C#Cc1ccc(Cl)s1
: