Target
Alpha-2C adrenergic receptor
Ligand
BDBM50236779
Substrate
Meas. Tech.
ChEMBL_1661760 (CHEMBL4011372)
Ki
>10000±n/a nM
Citation
 Tosh, DKJanowsky, AEshleman, AJWarnick, EGao, ZGChen, ZGizewski, EAuchampach, JASalvemini, DJacobson, KA Scaffold Repurposing of Nucleosides (Adenosine Receptor Agonists): Enhanced Activity at the Human Dopamine and Norepinephrine Sodium Symporters. J Med Chem 60:3109-3123 (2017)  
Target
Name:
Alpha-2C adrenergic receptor
Synonyms:
ADA2C_HUMAN ADRA2L2 Adrenergic alpha2C Adrenergic receptor alpha Alpha-2 adrenergic receptor subtype C4 Alpha-2C adrenoreceptor | adrenergic, alpha-2C-, receptor [Homo sapiens]
Type:
Enzyme
Mol. Mass.:
49552.32
Organism:
Homo sapiens (Human)
Description:
P18825
Residue:
462
  
Inhibitor
Name:
BDBM50236779
Synonyms:
CHEMBL4086593
Type:
Small organic molecule
Emp. Form.:
C20H21ClN6O4S
Mol. Mass.:
476.937
SMILES:
CCCNc1nc(nc2n(cnc12)[C@@H]1O[C@@H]([C@@H](O)[C@H]1O)C(=O)NC)C#Cc1ccc(Cl)s1
: