Target
Sodium-dependent serotonin transporter
Ligand
BDBM50236785
Substrate
Meas. Tech.
ChEMBL_1661746 (CHEMBL4011358)
Ki
<10000±n/a nM
Citation
 Tosh, DKJanowsky, AEshleman, AJWarnick, EGao, ZGChen, ZGizewski, EAuchampach, JASalvemini, DJacobson, KA Scaffold Repurposing of Nucleosides (Adenosine Receptor Agonists): Enhanced Activity at the Human Dopamine and Norepinephrine Sodium Symporters. J Med Chem 60:3109-3123 (2017)  
Target
Name:
Sodium-dependent serotonin transporter
Synonyms:
5-HT Transporter 5HTT SC6A4_HUMAN SLC6A4 Serotonin transporter (5HTT) Sodium-dependent serotonin transporter (SERT) | Solute carrier family 6 member 4
Type:
Multi-pass membrane protein
Mol. Mass.:
70322.51
Organism:
Homo sapiens (Human)
Description:
P31645
Residue:
630
  
Inhibitor
Name:
BDBM50236785
Synonyms:
CHEMBL4090355
Type:
Small organic molecule
Emp. Form.:
C18H17ClN6O4S
Mol. Mass.:
448.883
SMILES:
CNC(=O)[C@H]1O[C@H]([C@H](O)[C@@H]1O)n1cnc2c(NC)nc(nc12)C#Cc1ccc(Cl)s1
: