Target
Alpha-2A adrenergic receptor
Ligand
BDBM50236779
Substrate
Meas. Tech.
ChEMBL_1661751 (CHEMBL4011363)
Ki
5000±n/a nM
Citation
 Tosh, DKJanowsky, AEshleman, AJWarnick, EGao, ZGChen, ZGizewski, EAuchampach, JASalvemini, DJacobson, KA Scaffold Repurposing of Nucleosides (Adenosine Receptor Agonists): Enhanced Activity at the Human Dopamine and Norepinephrine Sodium Symporters. J Med Chem 60:3109-3123 (2017)  
Target
Name:
Alpha-2A adrenergic receptor
Synonyms:
ADA2A_HUMAN ADRA2R Adrenergic alpha2A Alpha-2 adrenergic receptor subtype C10 Alpha-2A adrenoreceptor alpha-2A adrenergic receptor [Homo sapiens]
Type:
Enzyme
Mol. Mass.:
48979.91
Organism:
Homo sapiens (Human)
Description:
P08913
Residue:
450
  
Inhibitor
Name:
BDBM50236779
Synonyms:
CHEMBL4086593
Type:
Small organic molecule
Emp. Form.:
C20H21ClN6O4S
Mol. Mass.:
476.937
SMILES:
CCCNc1nc(nc2n(cnc12)[C@@H]1O[C@@H]([C@@H](O)[C@H]1O)C(=O)NC)C#Cc1ccc(Cl)s1
: