Target
Sigma intracellular receptor 2
Ligand
BDBM50236719
Substrate
Meas. Tech.
ChEMBL_1661756 (CHEMBL4011368)
Ki
1900±n/a nM
Citation
 Tosh, DKJanowsky, AEshleman, AJWarnick, EGao, ZGChen, ZGizewski, EAuchampach, JASalvemini, DJacobson, KA Scaffold Repurposing of Nucleosides (Adenosine Receptor Agonists): Enhanced Activity at the Human Dopamine and Norepinephrine Sodium Symporters. J Med Chem 60:3109-3123 (2017)  
Target
Name:
Sigma intracellular receptor 2
Synonyms:
S2r Sigma intracellular receptor 2 Sigma2 receptor Transmembrane protein 97
Type:
Protein
Mol. Mass.:
20953.88
Organism:
Rattus norvegicus (Rat)
Description:
Q5U3Y7
Residue:
176
  
Inhibitor
Name:
BDBM50236719
Synonyms:
CHEMBL4078926
Type:
Small organic molecule
Emp. Form.:
C22H21ClN4O4S
Mol. Mass.:
472.945
SMILES:
[H][C@]12C[C@]1([C@@H](O)[C@@H](O)[C@@H]2n1cnc2c(NC)nc(cc12)C#Cc1ccc(Cl)s1)C(=O)OCC
: