Target
Transmembrane domain-containing protein TMIGD3
Ligand
BDBM50236804
Substrate
Meas. Tech.
ChEMBL_1661723 (CHEMBL4011335)
Ki
5.4±n/a nM
Citation
 Tosh, DKJanowsky, AEshleman, AJWarnick, EGao, ZGChen, ZGizewski, EAuchampach, JASalvemini, DJacobson, KA Scaffold Repurposing of Nucleosides (Adenosine Receptor Agonists): Enhanced Activity at the Human Dopamine and Norepinephrine Sodium Symporters. J Med Chem 60:3109-3123 (2017)  
Target
Name:
Transmembrane domain-containing protein TMIGD3
Synonyms:
TMIG3_HUMAN Transmembrane domain-containing protein TMIGD3
Type:
PROTEIN
Mol. Mass.:
30335.79
Organism:
Homo sapiens (Human)
Description:
ChEMBL_114868
Residue:
266
  
Inhibitor
Name:
BDBM50236804
Synonyms:
CHEMBL4066973
Type:
Small organic molecule
Emp. Form.:
C20H18ClN5O4S
Mol. Mass.:
459.906
SMILES:
[H][C@]12C[C@]1([C@@H](O)[C@@H](O)[C@@H]2n1cnc2c(NC)nc(nc12)C#Cc1ccc(Cl)s1)C(=O)OC
: