Target
Epidermal growth factor receptor
Ligand
BDBM50238182
Substrate
Meas. Tech.
ChEMBL_1663485 (CHEMBL4013166)
Ki
0.070000±n/a nM
Citation
 Günther, MLategahn, JJuchum, MDöring, EKeul, MEngel, JTumbrink, HLRauh, DLaufer, S Trisubstituted Pyridinylimidazoles as Potent Inhibitors of the Clinically Resistant L858R/T790M/C797S EGFR Mutant: Targeting of Both Hydrophobic Regions and the Phosphate Binding Site. J Med Chem 60:5613-5637 (2017)  
Target
Name:
Epidermal growth factor receptor
Synonyms:
EGF Receptor Substrate EGFR_HUMAN ERBB1 Epidermal Growth Factor Receptor erbB-1 Epidermal growth factor receptor (EGFR) HER1 Proto-oncogene c-ErbB-1 Tyrosine-Protein Kinase ErbB-1
Type:
Receptor Kinase Domain
Mol. Mass.:
134279.59
Organism:
Homo sapiens (Human)
Description:
P00533
Residue:
1210
  
Inhibitor
Name:
BDBM50238182
Synonyms:
CHEMBL4100860
Type:
Small organic molecule
Emp. Form.:
C27H26FN5O3
Mol. Mass.:
487.5254
SMILES:
COc1ccc(NC(=O)C=C)cc1Nc1cc(ccn1)-c1[nH]c(CCCO)nc1-c1ccc(F)cc1
: