Target
CREB-binding protein
Ligand
BDBM50238255
Substrate
Meas. Tech.
ChEMBL_1662831 (CHEMBL4012512)
IC50
240±n/a nM
Citation
 Denny, RAFlick, ACCoe, JLangille, JBasak, ALiu, SStock, ISahasrabudhe, PBonin, PHay, DABrennan, PEPletcher, MJones, LHChekler, ELP Structure-Based Design of Highly Selective Inhibitors of the CREB Binding Protein Bromodomain. J Med Chem 60:5349-5363 (2017)  
Target
Name:
CREB-binding protein
Synonyms:
CBP CREB-binding protein (CBP) CREBBP
Type:
Transcription Coactivator
Mol. Mass.:
265411.66
Organism:
Homo sapiens (Human)
Description:
Q92793
Residue:
2442
  
Inhibitor
Name:
BDBM50238255
Synonyms:
CHEMBL3753333
Type:
Small organic molecule
Emp. Form.:
C26H30N4O2
Mol. Mass.:
430.542
SMILES:
Cc1noc(C)c1-c1ccc2n(CCN3CCOCC3)c(CCc3ccccc3)nc2c1
: