Target
Adenosine receptor A2a
Ligand
BDBM50238381
Substrate
Meas. Tech.
ChEBML_1663191
Ki
2.9±n/a nM
Citation
 Falsini, MSquarcialupi, LCatarzi, DVarano, FBetti, MDal Ben, DMarucci, GBuccioni, MVolpini, RDe Vita, TCavalli, AColotta, V The 1,2,4-Triazolo[4,3-a]pyrazin-3-one as a Versatile Scaffold for the Design of Potent Adenosine Human Receptor Antagonists. Structural Investigations to Target the A J Med Chem 60:5772-5790 (2017)  
Target
Name:
Adenosine receptor A2a
Synonyms:
A2A adenosine receptor (hA2A) ADENOSINE A2 ADORA2 Adenosine A2A receptor (A2AAR)
Type:
G Protein-Coupled Receptor (GPCR)
Mol. Mass.:
44716.46
Organism:
Homo sapiens (Human)
Description:
P29274
Residue:
412
  
Inhibitor
Name:
BDBM50238381
Synonyms:
CHEMBL4064795
Type:
Small organic molecule
Emp. Form.:
C19H17N5O2
Mol. Mass.:
347.3706
SMILES:
CCOc1ccc(cc1)-c1cn2c(nn(-c3ccccc3)c2=O)c(N)n1
: