Target
Fibroblast growth factor receptor 1
Ligand
BDBM50238823
Substrate
Meas. Tech.
ChEMBL_1664135 (CHEMBL4013816)
IC50
0.800000±n/a nM
Citation
 Brameld, KAOwens, TDVerner, EVenetsanakos, EBradshaw, JMPhan, VTTam, DLeung, KShu, JLaStant, JLoughhead, DGTon, TKarr, DEGerritsen, MEGoldstein, DMFunk, JO Discovery of the Irreversible Covalent FGFR Inhibitor 8-(3-(4-Acryloylpiperazin-1-yl)propyl)-6-(2,6-dichloro-3,5-dimethoxyphenyl)-2-(methylamino)pyrido[2,3-d]pyrimidin-7(8H)-one (PRN1371) for the Treatment of Solid Tumors. J Med Chem 60:6516-6527 (2017)  
Target
Name:
Fibroblast growth factor receptor 1
Synonyms:
BFGFR Basic fibroblast growth factor receptor 1 (FGFR1) CEK FGFR-1 FGFR-1, (FL) FGFR1_HUMAN FLT2 Fibroblast growth factor receptor 1 (FGFR-1) Fms-like tyrosine kinase 2 N-sam bFGF-R | c-fgr
Type:
Receptor
Mol. Mass.:
91861.70
Organism:
Homo sapiens (Human)
Description:
P11362
Residue:
822
  
Inhibitor
Name:
BDBM50238823
Synonyms:
CHEMBL4086567
Type:
Small organic molecule
Emp. Form.:
C33H38ClN7O4
Mol. Mass.:
632.152
SMILES:
COc1cc(OC)c(Cl)c(c1)-c1cc2cnc(NCCN3CCN(C)CC3)nc2n(CCc2ccc(NC(=O)C=C)cc2)c1=O
: