Target
Lactoperoxidase
Ligand
BDBM50238841
Substrate
Meas. Tech.
ChEMBL_1664243 (CHEMBL4013924)
IC50
>5000±n/a nM
Citation
 Soubhye, JChikh Alard, IAldib, IPrévost, MGelbcke, MDe Carvalho, AFurtmüller, PGObinger, CFlemmig, JTadrent, SMeyer, FRousseau, ANève, JMathieu, VZouaoui Boudjeltia, KDufrasne, FVan Antwerpen, P Discovery of Novel Potent Reversible and Irreversible Myeloperoxidase Inhibitors Using Virtual Screening Procedure. J Med Chem 60:6563-6586 (2017)  
Target
Name:
Lactoperoxidase
Synonyms:
LPO PERL_BOVIN
Type:
Enzyme
Mol. Mass.:
80659.97
Organism:
Bos taurus (Bovine)
Description:
P80025
Residue:
712
  
Inhibitor
Name:
BDBM50238841
Synonyms:
CHEMBL4098162
Type:
Small organic molecule
Emp. Form.:
C12H14FN3O
Mol. Mass.:
235.2575
SMILES:
CC(C)NCC(=O)c1nc2cc(F)ccc2[nH]1
: