Target
Lactoperoxidase
Ligand
BDBM7458
Substrate
Meas. Tech.
ChEMBL_1664243 (CHEMBL4013924)
IC50
17800±n/a nM
Citation
 Soubhye, JChikh Alard, IAldib, IPrévost, MGelbcke, MDe Carvalho, AFurtmüller, PGObinger, CFlemmig, JTadrent, SMeyer, FRousseau, ANève, JMathieu, VZouaoui Boudjeltia, KDufrasne, FVan Antwerpen, P Discovery of Novel Potent Reversible and Irreversible Myeloperoxidase Inhibitors Using Virtual Screening Procedure. J Med Chem 60:6563-6586 (2017)  
Target
Name:
Lactoperoxidase
Synonyms:
LPO PERL_BOVIN
Type:
Enzyme
Mol. Mass.:
80659.97
Organism:
Bos taurus (Bovine)
Description:
P80025
Residue:
712
  
Inhibitor
Name:
BDBM7458
Synonyms:
5,7-dihydroxy-2-(4-hydroxyphenyl)-4H-chromen-4-one Apigenin Apigenin (3) Apigenin, 13 Naringenin, 18 US11337935, Compound Apigenin cid_5280443 | jm5b01461, Compound 90
Type:
Small organic molecule
Emp. Form.:
C15H10O5
Mol. Mass.:
270.2369
SMILES:
Oc1ccc(cc1)-c1cc(=O)c2c(O)cc(O)cc2o1
: