Target
Lactoperoxidase
Ligand
BDBM50238837
Substrate
Meas. Tech.
ChEMBL_1664243 (CHEMBL4013924)
IC50
3200±n/a nM
Citation
 Soubhye, JChikh Alard, IAldib, IPrévost, MGelbcke, MDe Carvalho, AFurtmüller, PGObinger, CFlemmig, JTadrent, SMeyer, FRousseau, ANève, JMathieu, VZouaoui Boudjeltia, KDufrasne, FVan Antwerpen, P Discovery of Novel Potent Reversible and Irreversible Myeloperoxidase Inhibitors Using Virtual Screening Procedure. J Med Chem 60:6563-6586 (2017)  
Target
Name:
Lactoperoxidase
Synonyms:
LPO PERL_BOVIN
Type:
Enzyme
Mol. Mass.:
80659.97
Organism:
Bos taurus (Bovine)
Description:
P80025
Residue:
712
  
Inhibitor
Name:
BDBM50238837
Synonyms:
CHEMBL581893 | GNF-Pf-3346
Type:
Small organic molecule
Emp. Form.:
C11H13N5O
Mol. Mass.:
231.2538
SMILES:
COc1ccc2c(C)nc(NC(N)=N)nc2c1
: