Target
D(3) dopamine receptor
Ligand
BDBM81792
Substrate
Ki
36.5±n/a nM
Comments
PDSP_1942
Citation
 Boundy, VALuedtke, RRGallitano, ALSmith, JEFiltz, TMKallen, RGMolinoff, PB Expression and characterization of the rat D3 dopamine receptor: pharmacologic properties and development of antibodies. J Pharmacol Exp Ther 264:1002-11 (1993) Target
Name:
D(3) dopamine receptor
Synonyms:
DOPAMINE D3 Dopamine D3 receptor | Drd3
Type:
Protein
Mol. Mass.:
49540.58
Organism:
Rattus norvegicus (Rat)
Description:
P19020
Residue:
446
  
Inhibitor
Name:
BDBM81792
Synonyms:
CAS_5311190 UH232 | UH232(+)
Type:
Small organic molecule
Emp. Form.:
C18H27NO
Mol. Mass.:
273.4131
SMILES:
CCCN(CCC)C1C=Cc2c(OC)cccc2C1C
: