Target
Casein kinase I isoform epsilon
Ligand
BDBM274530
Substrate
Meas. Tech.
Kinase Assay
pH
7.4±n/a
Temperature
298.15±n/a K
IC50
0.128±n/a nM
Comments
extracted
Citation
 Velaparthi, UDarne, CPDodd, DSSampognaro, AJWittman, MDKumaravel, SMullick, DLiu, PRachamreddy, CR Substituted imidazoles as casein kinase 1 D/E inhibitors US Patent  US9556179 Publication Date 1/31/2017 
Target
Name:
Casein kinase I isoform epsilon
Synonyms:
Axin-1/Casein kinase I epsilon CKIe Casein kinase 1 epsilon (CK1Ɛ) Casein kinase I isoform epsilon (CK1 epsilon) Casein kinase I isoform epsilon (CK1epsilon) | KC1E_HUMAN
Type:
Protein
Mol. Mass.:
47340.25
Organism:
Homo sapiens (Human)
Description:
P49674
Residue:
416
  
Inhibitor
Name:
BDBM274530
Synonyms:
N-(6-(1-(1-(2-amino-2- oxoethyl)piperidin-4-yl)-4-(4- fluorophenyl)-1H-imidazol-5- yl)imidazo[1,2-b] pyridazin-2-yl)-4- methyl-2-(pyridin-3-yl) thiazole-5- carboxamide | US9556179, Compound 100
Type:
Small organic molecule
Emp. Form.:
C32H29FN10O2S
Mol. Mass.:
636.702
SMILES:
Cc1nc(sc1C(=O)Nc1cn2nc(ccc2n1)-c1c(ncn1C1CCN(CC(N)=O)CC1)-c1ccc(F)cc1)-c1cccnc1
: