Target
Cannabinoid receptor 1
Ligand
BDBM50323910
Substrate
Ki
735±n/a nM
Comments
PDSP_997
Citation
 Compton, DRRice, KCDe Costa, BRRazdan, RKMelvin, LSJohnson, MRMartin, BR Cannabinoid structure-activity relationships: correlation of receptor binding and in vivo activities. J Pharmacol Exp Ther 265:218-26 (1993) Target
Name:
Cannabinoid receptor 1
Synonyms:
Brain-type cannabinoid receptor CB-R CNR1_RAT Cannabinoid receptor Cnr1 | Skr6
Type:
G Protein-Coupled Receptor (GPCR)
Mol. Mass.:
52856.55
Organism:
Rattus norvegicus (rat)
Description:
P20272
Residue:
473
  
Inhibitor
Name:
BDBM50323910
Synonyms:
2-((1S,3R)-3-hydroxycyclohexyl)-5-(2-methyloctan-2-yl)phenol CHEMBL163701 CP-47,497 | CP-47497
Type:
Small organic molecule
Emp. Form.:
C21H34O2
Mol. Mass.:
318.4935
SMILES:
CCCCCCC(C)(C)c1ccc([C@H]2CCC[C@@H](O)C2)c(O)c1
: