Target
Cannabinoid receptor 1
Ligand
BDBM84900
Substrate
Ki
>10000±n/a nM
Comments
PDSP_1814
Citation
 Compton, DRRice, KCDe Costa, BRRazdan, RKMelvin, LSJohnson, MRMartin, BR Cannabinoid structure-activity relationships: correlation of receptor binding and in vivo activities. J Pharmacol Exp Ther 265:218-26 (1993) Target
Name:
Cannabinoid receptor 1
Synonyms:
Brain-type cannabinoid receptor CB-R CNR1_RAT Cannabinoid receptor Cnr1 | Skr6
Type:
G Protein-Coupled Receptor (GPCR)
Mol. Mass.:
52856.55
Organism:
Rattus norvegicus (rat)
Description:
P20272
Residue:
473
  
Inhibitor
Name:
BDBM84900
Synonyms:
THC, 1-O-(3-Aminopropyl)
Type:
Small organic molecule
Emp. Form.:
C24H37NO2
Mol. Mass.:
371.5561
SMILES:
CCCCCc1cc(OCCCN)c2[C@@H]3C=C(C)CC[C@H]3C(C)(C)Oc2c1
: