Target
Cannabinoid receptor 1
Ligand
BDBM84912
Substrate
Ki
>10000±n/a nM
Comments
PDSP_1821
Citation
 Compton, DRRice, KCDe Costa, BRRazdan, RKMelvin, LSJohnson, MRMartin, BR Cannabinoid structure-activity relationships: correlation of receptor binding and in vivo activities. J Pharmacol Exp Ther 265:218-26 (1993) Target
Name:
Cannabinoid receptor 1
Synonyms:
Brain-type cannabinoid receptor CB-R CNR1_RAT Cannabinoid receptor Cnr1 | Skr6
Type:
G Protein-Coupled Receptor (GPCR)
Mol. Mass.:
52856.55
Organism:
Rattus norvegicus (rat)
Description:
P20272
Residue:
473
  
Inhibitor
Name:
BDBM84912
Synonyms:
THC, 1-O-Methyl-3-(norpentyl)-3-propyl
Type:
Small organic molecule
Emp. Form.:
C25H38O2
Mol. Mass.:
370.568
SMILES:
CCCC(CC)CCc1cc(OC)c2[C@@H]3CC(=C)CC[C@H]3C(C)(C)Oc2c1
: