Target
Cannabinoid receptor 1
Ligand
BDBM84891
Substrate
Ki
2170±n/a nM
Comments
PDSP_1822
Citation
 Compton, DRRice, KCDe Costa, BRRazdan, RKMelvin, LSJohnson, MRMartin, BR Cannabinoid structure-activity relationships: correlation of receptor binding and in vivo activities. J Pharmacol Exp Ther 265:218-26 (1993) Target
Name:
Cannabinoid receptor 1
Synonyms:
Brain-type cannabinoid receptor CB-R CNR1_RAT Cannabinoid receptor Cnr1 | Skr6
Type:
G Protein-Coupled Receptor (GPCR)
Mol. Mass.:
52856.55
Organism:
Rattus norvegicus (rat)
Description:
P20272
Residue:
473
  
Inhibitor
Name:
BDBM84891
Synonyms:
THC, 1-O-Methyl-delta 8
Type:
Emp. Form.:
C26H40O3
Mol. Mass.:
400.594
SMILES:
CCCCCCC(C)(C)c1cc(OC)c2[C@@H]3C=C(CO)CC[C@H]3C(C)(C)Oc2c1
: