Target
Cannabinoid receptor 1
Ligand
BDBM84883
Substrate
Ki
7.63±n/a nM
Comments
PDSP_1828
Citation
 Compton, DRRice, KCDe Costa, BRRazdan, RKMelvin, LSJohnson, MRMartin, BR Cannabinoid structure-activity relationships: correlation of receptor binding and in vivo activities. J Pharmacol Exp Ther 265:218-26 (1993) Target
Name:
Cannabinoid receptor 1
Synonyms:
Brain-type cannabinoid receptor CB-R CNR1_RAT Cannabinoid receptor Cnr1 | Skr6
Type:
G Protein-Coupled Receptor (GPCR)
Mol. Mass.:
52856.55
Organism:
Rattus norvegicus (rat)
Description:
P20272
Residue:
473
  
Inhibitor
Name:
BDBM84883
Synonyms:
THC, 5'-Br
Type:
Small organic molecule
Emp. Form.:
C21H29BrO2
Mol. Mass.:
393.358
SMILES:
CC1=C[C@@H]2[C@@H](CC1)C(C)(C)Oc1cc(CCCCCBr)cc(O)c21
: