Target
Cannabinoid receptor 1
Ligand
BDBM84904
Substrate
Ki
28.5±n/a nM
Comments
PDSP_1951
Citation
 Compton, DRRice, KCDe Costa, BRRazdan, RKMelvin, LSJohnson, MRMartin, BR Cannabinoid structure-activity relationships: correlation of receptor binding and in vivo activities. J Pharmacol Exp Ther 265:218-26 (1993) Target
Name:
Cannabinoid receptor 1
Synonyms:
Brain-type cannabinoid receptor CB-R CNR1_RAT Cannabinoid receptor Cnr1 | Skr6
Type:
G Protein-Coupled Receptor (GPCR)
Mol. Mass.:
52856.55
Organism:
Rattus norvegicus (rat)
Description:
P20272
Residue:
473
  
Inhibitor
Name:
BDBM84904
Synonyms:
Bicyclic analogs VIII
Type:
Small organic molecule
Emp. Form.:
C23H38O2
Mol. Mass.:
346.5466
SMILES:
CCCCCCCCC(C)(C)c1ccc([C@H]2CCC[C@@H](O)C2)c(O)c1
: