Target
Somatostatin receptor type 1
Ligand
BDBM81766
Substrate
Ki
1000±n/a nM
Comments
PDSP_1242
Citation
 Reisine, TBell, GI Molecular biology of somatostatin receptors. Endocr Rev 16:427-42 (1995)  
Target
Name:
Somatostatin receptor type 1
Synonyms:
SOMATOSTATIN SST1 SS-1-R SS1R SSTR1 | Somatostatin receptor type 1 (SSTR1)
Type:
Enzyme
Mol. Mass.:
42692.81
Organism:
Homo sapiens (Human)
Description:
P30872
Residue:
391
  
Inhibitor
Name:
BDBM81766
Synonyms:
CAS_3086456 NSC_3086456
Type:
Small organic molecule
Emp. Form.:
C44H56N8O7
Mol. Mass.:
808.9648
SMILES:
CC(C)C1NC(=O)C(CCCCN)NC(=O)C(Cc2c[nH]c3ccccc23)NC(=O)C(Cc2ccc(O)cc2)NC(=O)C(C)N(C)C(=O)C(Cc2ccccc2)NC1=O
: