Target
5-hydroxytryptamine receptor 2A
Ligand
BDBM84946
Substrate
Ki
2.5±n/a nM
Comments
PDSP_1603
Citation
 Roth, BLTandra, SBurgess, LHSibley, DRMeltzer, HY D4 dopamine receptor binding affinity does not distinguish between typical and atypical antipsychotic drugs. Psychopharmacology (Berl) 120:365-8 (1995)  
Target
Name:
5-hydroxytryptamine receptor 2A
Synonyms:
5-HT-2A 5-HT2A 5-hydroxytryptamine receptor 2A (5HT2A) Htr2 Serotonin Receptor 2A
Type:
G Protein-Coupled Receptor (GPCR)
Mol. Mass.:
52852.05
Organism:
Rattus norvegicus (rat)
Description:
Rat cortex membranes 5-HT2A receptors.
Residue:
471
  
Inhibitor
Name:
BDBM84946
Synonyms:
CAS_170154 RMI 81,582
Type:
Small organic molecule
Emp. Form.:
C19H19ClN2
Mol. Mass.:
310.821
SMILES:
CN(C)CCC=C1c2ccccc2C=Nc2ccc(Cl)cc12
: