Target
5-hydroxytryptamine receptor 2A
Ligand
BDBM50007692
Substrate
Ki
0.06±n/a nM
Comments
PDSP_1858
Citation
 Roth, BLTandra, SBurgess, LHSibley, DRMeltzer, HY D4 dopamine receptor binding affinity does not distinguish between typical and atypical antipsychotic drugs. Psychopharmacology (Berl) 120:365-8 (1995)  
Target
Name:
5-hydroxytryptamine receptor 2A
Synonyms:
5-HT-2A 5-HT2A 5-hydroxytryptamine receptor 2A (5HT2A) Htr2 Serotonin Receptor 2A
Type:
G Protein-Coupled Receptor (GPCR)
Mol. Mass.:
52852.05
Organism:
Rattus norvegicus (rat)
Description:
Rat cortex membranes 5-HT2A receptors.
Residue:
471
  
Inhibitor
Name:
BDBM50007692
Synonyms:
8-[4-(4-Benzo[d]isothiazol-3-yl-piperazin-1-yl)-butyl]-8-aza-spiro[4.5]decane-7,9-dione CHEMBL35057 | TIOSPERONE
Type:
Small organic molecule
Emp. Form.:
C24H32N4O2S
Mol. Mass.:
440.601
SMILES:
O=C1CC2(CCCC2)CC(=O)N1CCCCN1CCN(CC1)c1nsc2ccccc12
: